Reaction Details
TargetHistamine H1 receptor
LigandBDBM50119696
Substrate/Competitorn/a
Meas. Tech.ChEBML_84425
Ki 90000±n/a nM
Citation Vasudevan, AConner, SEGentles, RGFaghih, RLiu, HDwight, WIreland, LKang, CHEsbenshade, TABennani, YLHancock, AA Synthesis and evaluation of potent pyrrolidine H(3) antagonists. Bioorg Med Chem Lett12:3055-8 (2002) Histamine H1 receptor
Name:Histamine H1 receptor
Type:G Protein-Coupled Receptor (GPCR)
Mol. Mass.:55808.72
Organism:Homo sapiens (Human)
Description:Cell pellets from SK-N-MC cells transfected with human H1 receptor were used in binding assay.
Residue:487
BDBM50119696
NameBDBM50119696
Synonyms:1-{4-[3-((S)-3-Amino-pyrrolidin-1-yl)-propoxy]-phenyl}-ethanone | CHEMBL319231
TypeSmall organic molecule
Emp. Form.C15H22N2O2
Mol. Mass.262.3474
SMILESCC(=O)c1ccc(OCCCN2CC[C@H](N)C2)cc1