Reaction Details
TargetHistamine H1 receptor
LigandBDBM50119700
Substrate/Competitorn/a
Meas. Tech.ChEBML_84425
Ki 80000±n/a nM
Citation Vasudevan, AConner, SEGentles, RGFaghih, RLiu, HDwight, WIreland, LKang, CHEsbenshade, TABennani, YLHancock, AA Synthesis and evaluation of potent pyrrolidine H(3) antagonists. Bioorg Med Chem Lett12:3055-8 (2002) Histamine H1 receptor
Name:Histamine H1 receptor
Type:G Protein-Coupled Receptor (GPCR)
Mol. Mass.:55808.72
Organism:Homo sapiens (Human)
Description:Cell pellets from SK-N-MC cells transfected with human H1 receptor were used in binding assay.
Residue:487
BDBM50119700
NameBDBM50119700
Synonyms:(1-{(S)-1-[3-(4-Acetyl-phenoxy)-propyl]-pyrrolidin-3-ylcarbamoyl}-2-hydroxy-ethyl)-carbamic acid tert-butyl ester | CHEMBL102390
TypeSmall organic molecule
Emp. Form.C23H35N3O6
Mol. Mass.449.5405
SMILESCC(=O)c1ccc(OCCCN2CC[C@@H](C2)NC(=O)[C@@H](CO)NC(=O)OC(C)(C)C)cc1