Reaction Details
TargetHistamine H1 receptor
LigandBDBM50119703
Substrate/Competitorn/a
Meas. Tech.ChEBML_84425
Ki 7400±n/a nM
Citation Vasudevan, AConner, SEGentles, RGFaghih, RLiu, HDwight, WIreland, LKang, CHEsbenshade, TABennani, YLHancock, AA Synthesis and evaluation of potent pyrrolidine H(3) antagonists. Bioorg Med Chem Lett12:3055-8 (2002) Histamine H1 receptor
Name:Histamine H1 receptor
Type:G Protein-Coupled Receptor (GPCR)
Mol. Mass.:55808.72
Organism:Homo sapiens (Human)
Description:Cell pellets from SK-N-MC cells transfected with human H1 receptor were used in binding assay.
Residue:487
BDBM50119703
NameBDBM50119703
Synonyms:CHEMBL102331 | N-{(S)-1-[3-(4-Acetyl-phenoxy)-propyl]-pyrrolidin-3-yl}-nicotinamide
TypeSmall organic molecule
Emp. Form.C21H25N3O3
Mol. Mass.367.4415
SMILESCC(=O)c1ccc(OCCCN2CC[C@@H](C2)NC(=O)c2cccnc2)cc1