Reaction Details
TargetHistamine H3 receptor
LigandBDBM50119709
Substrate/Competitorn/a
Meas. Tech.ChEBML_87253
Ki 202±n/a nM
Citation Vasudevan, AConner, SEGentles, RGFaghih, RLiu, HDwight, WIreland, LKang, CHEsbenshade, TABennani, YLHancock, AA Synthesis and evaluation of potent pyrrolidine H(3) antagonists. Bioorg Med Chem Lett12:3055-8 (2002) Histamine H3 receptor
Name:Histamine H3 receptor
Type:G Protein-Coupled Receptor (GPCR)
Mol. Mass.:48607.98
Organism:Rattus norvegicus (rat)
Description:n/a
Residue:445
BDBM50119709
NameBDBM50119709
Synonyms:CHEMBL322695 | Pyrazine-2-carboxylic acid {(S)-1-[3-(4-acetyl-phenoxy)-propyl]-pyrrolidin-3-yl}-amide
TypeSmall organic molecule
Emp. Form.C20H24N4O3
Mol. Mass.368.4296
SMILESCC(=O)c1ccc(OCCCN2CC[C@@H](C2)NC(=O)c2cnccn2)cc1