Reaction Details
TargetHistamine H1 receptor
LigandBDBM50119705
Substrate/Competitorn/a
Meas. Tech.ChEBML_84425
Ki 9100±n/a nM
Citation Vasudevan, AConner, SEGentles, RGFaghih, RLiu, HDwight, WIreland, LKang, CHEsbenshade, TABennani, YLHancock, AA Synthesis and evaluation of potent pyrrolidine H(3) antagonists. Bioorg Med Chem Lett12:3055-8 (2002) Histamine H1 receptor
Name:Histamine H1 receptor
Type:G Protein-Coupled Receptor (GPCR)
Mol. Mass.:55808.72
Organism:Homo sapiens (Human)
Description:Cell pellets from SK-N-MC cells transfected with human H1 receptor were used in binding assay.
Residue:487
BDBM50119705
NameBDBM50119705
Synonyms:CHEMBL101691 | N-{(S)-1-[3-(4-Cyclopropanecarbonyl-phenoxy)-propyl]-pyrrolidin-3-yl}-benzenesulfonamide
TypeSmall organic molecule
Emp. Form.C23H28N2O4S
Mol. Mass.428.544
SMILESO=C(C1CC1)c1ccc(OCCCN2CC[C@@H](C2)NS(=O)(=O)c2ccccc2)cc1