Reaction Details
TargetHistamine H3 receptor
LigandBDBM50119727
Substrate/Competitorn/a
Meas. Tech.ChEBML_87253
Ki 232±n/a nM
Citation Vasudevan, AConner, SEGentles, RGFaghih, RLiu, HDwight, WIreland, LKang, CHEsbenshade, TABennani, YLHancock, AA Synthesis and evaluation of potent pyrrolidine H(3) antagonists. Bioorg Med Chem Lett12:3055-8 (2002) Histamine H3 receptor
Name:Histamine H3 receptor
Type:G Protein-Coupled Receptor (GPCR)
Mol. Mass.:48607.98
Organism:Rattus norvegicus (rat)
Description:n/a
Residue:445
BDBM50119727
NameBDBM50119727
Synonyms:(S)-2-({(2S,7S)-5-[3-(4-Cyclopropanecarbonyl-phenoxy)-propyl]-2,5-diaza-bicyclo[2.2.1]heptane-2-carbonyl}-amino)-propionic acid | CHEMBL106069
TypeSmall organic molecule
Emp. Form.C22H29N3O5
Mol. Mass.415.4828
SMILESC[C@H](NC(=O)N1C[C@@H]2C[C@H]1CN2CCCOc1ccc(cc1)C(=O)C1CC1)C(O)=O