Reaction Details
TargetHistamine H3 receptor
LigandBDBM50119702
Substrate/Competitorn/a
Meas. Tech.ChEBML_87253
Ki 4.6±n/a nM
Citation Vasudevan, AConner, SEGentles, RGFaghih, RLiu, HDwight, WIreland, LKang, CHEsbenshade, TABennani, YLHancock, AA Synthesis and evaluation of potent pyrrolidine H(3) antagonists. Bioorg Med Chem Lett12:3055-8 (2002) Histamine H3 receptor
Name:Histamine H3 receptor
Type:G Protein-Coupled Receptor (GPCR)
Mol. Mass.:48607.98
Organism:Rattus norvegicus (rat)
Description:n/a
Residue:445
BDBM50119702
NameBDBM50119702
Synonyms:CHEMBL102925 | N-{(S)-1-[3-(4-Cyclopropanecarbonyl-phenoxy)-propyl]-pyrrolidin-3-yl}-4-ethyl-benzenesulfonamide
TypeSmall organic molecule
Emp. Form.C25H32N2O4S
Mol. Mass.456.598
SMILESCCc1ccc(cc1)S(=O)(=O)N[C@H]1CCN(CCCOc2ccc(cc2)C(=O)C2CC2)C1