Reaction Details
TargetHistamine H3 receptor
LigandBDBM50119729
Substrate/Competitorn/a
Meas. Tech.ChEBML_87253
Ki 208±n/a nM
Citation Vasudevan, AConner, SEGentles, RGFaghih, RLiu, HDwight, WIreland, LKang, CHEsbenshade, TABennani, YLHancock, AA Synthesis and evaluation of potent pyrrolidine H(3) antagonists. Bioorg Med Chem Lett12:3055-8 (2002) Histamine H3 receptor
Name:Histamine H3 receptor
Type:G Protein-Coupled Receptor (GPCR)
Mol. Mass.:48607.98
Organism:Rattus norvegicus (rat)
Description:n/a
Residue:445
BDBM50119729
NameBDBM50119729
Synonyms:CHEMBL102853 | Cyclopropyl-(4-{3-[(1S,4S)-5-(furan-2-carbonyl)-2,5-diaza-bicyclo[2.2.1]hept-2-yl]-propoxy}-phenyl)-methanone
TypeSmall organic molecule
Emp. Form.C23H26N2O4
Mol. Mass.394.4635
SMILESO=C(C1CC1)c1ccc(OCCCN2C[C@@H]3C[C@H]2CN3C(=O)c2ccco2)cc1