Reaction Details
TargetHistamine H2 receptor
LigandBDBM50119730
Substrate/Competitorn/a
Meas. Tech.ChEBML_85525
Ki 2200±n/a nM
Citation Vasudevan, AConner, SEGentles, RGFaghih, RLiu, HDwight, WIreland, LKang, CHEsbenshade, TABennani, YLHancock, AA Synthesis and evaluation of potent pyrrolidine H(3) antagonists. Bioorg Med Chem Lett12:3055-8 (2002) Histamine H2 receptor
Name:Histamine H2 receptor
Type:G Protein-Coupled Receptor (GPCR)
Mol. Mass.:40115.31
Organism:Homo sapiens (Human)
Description:n/a
Residue:359
BDBM50119730
NameBDBM50119730
Synonyms:CHEMBL102929 | N-{(S)-1-[3-(4-Cyclopropanecarbonyl-phenoxy)-propyl]-pyrrolidin-3-yl}-2-methyl-benzenesulfonamide
TypeSmall organic molecule
Emp. Form.C24H30N2O4S
Mol. Mass.442.571
SMILESCc1ccccc1S(=O)(=O)N[C@H]1CCN(CCCOc2ccc(cc2)C(=O)C2CC2)C1