Reaction Details
TargetHistamine H3 receptor
LigandBDBM50119734
Substrate/Competitorn/a
Meas. Tech.ChEBML_87253
Ki 120±n/a nM
Citation Vasudevan, AConner, SEGentles, RGFaghih, RLiu, HDwight, WIreland, LKang, CHEsbenshade, TABennani, YLHancock, AA Synthesis and evaluation of potent pyrrolidine H(3) antagonists. Bioorg Med Chem Lett12:3055-8 (2002) Histamine H3 receptor
Name:Histamine H3 receptor
Type:G Protein-Coupled Receptor (GPCR)
Mol. Mass.:48607.98
Organism:Rattus norvegicus (rat)
Description:n/a
Residue:445
BDBM50119734
NameBDBM50119734
Synonyms:CHEMBL102283 | Cyclopropyl-{4-[3-((1S,4S)-5-ethanesulfonyl-2,5-diaza-bicyclo[2.2.1]hept-2-yl)-propoxy]-phenyl}-methanone
TypeSmall organic molecule
Emp. Form.C20H28N2O4S
Mol. Mass.392.512
SMILESCCS(=O)(=O)N1C[C@@H]2C[C@H]1CN2CCCOc1ccc(cc1)C(=O)C1CC1