Reaction Details
TargetHistamine H2 receptor
LigandBDBM50119696
Substrate/Competitorn/a
Meas. Tech.ChEMBL_85524 (CHEMBL697135)
Ki 50000±n/a nM
Citation Vasudevan, AConner, SEGentles, RGFaghih, RLiu, HDwight, WIreland, LKang, CHEsbenshade, TABennani, YLHancock, AA Synthesis and evaluation of potent pyrrolidine H(3) antagonists. Bioorg Med Chem Lett12:3055-8 (2002) Histamine H2 receptor
Name:Histamine H2 receptor
Type:G Protein-Coupled Receptor (GPCR)
Mol. Mass.:40115.31
Organism:Homo sapiens (Human)
Description:n/a
Residue:359
BDBM50119696
NameBDBM50119696
Synonyms:1-{4-[3-((S)-3-Amino-pyrrolidin-1-yl)-propoxy]-phenyl}-ethanone | CHEMBL319231
TypeSmall organic molecule
Emp. Form.C15H22N2O2
Mol. Mass.262.3474
SMILESCC(=O)c1ccc(OCCCN2CC[C@H](N)C2)cc1