Reaction Details
TargetHistamine H1 receptor
LigandBDBM50119718
Substrate/Competitorn/a
Meas. Tech.ChEBML_84425
Ki 60000±n/a nM
Citation Vasudevan, AConner, SEGentles, RGFaghih, RLiu, HDwight, WIreland, LKang, CHEsbenshade, TABennani, YLHancock, AA Synthesis and evaluation of potent pyrrolidine H(3) antagonists. Bioorg Med Chem Lett12:3055-8 (2002) Histamine H1 receptor
Name:Histamine H1 receptor
Type:G Protein-Coupled Receptor (GPCR)
Mol. Mass.:55808.72
Organism:Homo sapiens (Human)
Description:Cell pellets from SK-N-MC cells transfected with human H1 receptor were used in binding assay.
Residue:487
BDBM50119718
NameBDBM50119718
Synonyms:((S)-1-{(S)-1-[3-(4-Acetyl-phenoxy)-propyl]-pyrrolidin-3-ylcarbamoyl}-ethyl)-carbamic acid tert-butyl ester | CHEMBL320174
TypeSmall organic molecule
Emp. Form.C23H35N3O5
Mol. Mass.433.5411
SMILESC[C@H](NC(=O)OC(C)(C)C)C(=O)N[C@H]1CCN(CCCOc2ccc(cc2)C(C)=O)C1