Reaction Details
TargetHistamine H2 receptor
LigandBDBM50119733
Substrate/Competitorn/a
Meas. Tech.ChEBML_85525
Ki 2300±n/a nM
Citation Vasudevan, AConner, SEGentles, RGFaghih, RLiu, HDwight, WIreland, LKang, CHEsbenshade, TABennani, YLHancock, AA Synthesis and evaluation of potent pyrrolidine H(3) antagonists. Bioorg Med Chem Lett12:3055-8 (2002) Histamine H2 receptor
Name:Histamine H2 receptor
Type:G Protein-Coupled Receptor (GPCR)
Mol. Mass.:40115.31
Organism:Homo sapiens (Human)
Description:n/a
Residue:359
BDBM50119733
NameBDBM50119733
Synonyms:CHEMBL102840 | N-{(S)-1-[3-(4-Acetyl-phenoxy)-propyl]-pyrrolidin-3-yl}-4-cyano-benzenesulfonamide
TypeSmall organic molecule
Emp. Form.C22H25N3O4S
Mol. Mass.427.517
SMILESCC(=O)c1ccc(OCCCN2CC[C@@H](C2)NS(=O)(=O)c2ccc(cc2)C#N)cc1