Reaction Details
TargetHistamine H2 receptor
LigandBDBM50119709
Substrate/Competitorn/a
Meas. Tech.ChEBML_85525
Ki 5000±n/a nM
Citation Vasudevan, AConner, SEGentles, RGFaghih, RLiu, HDwight, WIreland, LKang, CHEsbenshade, TABennani, YLHancock, AA Synthesis and evaluation of potent pyrrolidine H(3) antagonists. Bioorg Med Chem Lett12:3055-8 (2002) Histamine H2 receptor
Name:Histamine H2 receptor
Type:G Protein-Coupled Receptor (GPCR)
Mol. Mass.:40115.31
Organism:Homo sapiens (Human)
Description:n/a
Residue:359
BDBM50119709
NameBDBM50119709
Synonyms:CHEMBL322695 | Pyrazine-2-carboxylic acid {(S)-1-[3-(4-acetyl-phenoxy)-propyl]-pyrrolidin-3-yl}-amide
TypeSmall organic molecule
Emp. Form.C20H24N4O3
Mol. Mass.368.4296
SMILESCC(=O)c1ccc(OCCCN2CC[C@@H](C2)NC(=O)c2cnccn2)cc1