Reaction Details
TargetEndothelin-converting enzyme 1
LigandBDBM50091882
Substrate/Competitorn/a
Meas. Tech.ChEBML_64356
IC50 11±n/a nM
Citation Firooznia, FGude, CChan, KTan, JFink, CASavage, PBeil, MEBruseo, CWTrapani, AJJeng, AY Synthesis and biological activity of potent heterocyclic thiol-based inhibitors of endothelin-converting enzyme-1. Bioorg Med Chem Lett12:3059-62 (2002) Endothelin-converting enzyme 1
Name:Endothelin-converting enzyme 1
Type:Enzyme
Mol. Mass.:87155.11
Organism:Homo sapiens (Human)
Description:P42892
Residue:770
BDBM50091882
NameBDBM50091882
Synonyms:(S)-3-Biphenyl-4-yl-2-{[1-((S)-2-mercapto-1-oxo-pentylamino)-cyclopentanecarbonyl]-amino}-propionic acid 3-Biphenyl-4-yl-2-{[1-(2-mercapto-pentanoylamino)-cyclopentanecarbonyl]-amino}-propionic acid | CHEMBL292748
TypeSmall organic molecule
Emp. Form.C26H32N2O4S
Mol. Mass.468.608
SMILESCCC[C@H](S)C(=O)NC1(CCCC1)C(=O)N[C@@H](Cc1ccc(cc1)-c1ccccc1)C(O)=O