Reaction Details
TargetEndothelin-converting enzyme 1
LigandBDBM50119751
Substrate/Competitorn/a
Meas. Tech.ChEBML_64356
IC50 9.5±n/a nM
Citation Firooznia, FGude, CChan, KTan, JFink, CASavage, PBeil, MEBruseo, CWTrapani, AJJeng, AY Synthesis and biological activity of potent heterocyclic thiol-based inhibitors of endothelin-converting enzyme-1. Bioorg Med Chem Lett12:3059-62 (2002) Endothelin-converting enzyme 1
Name:Endothelin-converting enzyme 1
Type:Enzyme
Mol. Mass.:87155.11
Organism:Homo sapiens (Human)
Description:P42892
Residue:770
BDBM50119751
NameBDBM50119751
Synonyms:2-{[1-(2-Mercapto-4-methyl-pentanoylamino)-cyclopentanecarbonyl]-amino}-3-(6-thiophen-2-yl-pyridin-3-yl)-propionic acid | CHEMBL317472
TypeSmall organic molecule
Emp. Form.C24H31N3O4S2
Mol. Mass.489.651
SMILESCC(C)C[C@H](S)C(=O)NC1(CCCC1)C(=O)N[C@@H](Cc1ccc(nc1)-c1cccs1)C(O)=O