Reaction Details
TargetEndothelin-converting enzyme 1
LigandBDBM50119750
Substrate/Competitorn/a
Meas. Tech.ChEBML_64356
IC50 43±n/a nM
Citation Firooznia, FGude, CChan, KTan, JFink, CASavage, PBeil, MEBruseo, CWTrapani, AJJeng, AY Synthesis and biological activity of potent heterocyclic thiol-based inhibitors of endothelin-converting enzyme-1. Bioorg Med Chem Lett12:3059-62 (2002) Endothelin-converting enzyme 1
Name:Endothelin-converting enzyme 1
Type:Enzyme
Mol. Mass.:87155.11
Organism:Homo sapiens (Human)
Description:P42892
Residue:770
BDBM50119750
NameBDBM50119750
Synonyms:3-(6-Furan-2-yl-pyridin-3-yl)-2-{[1-(2-mercapto-3-methyl-butyrylamino)-cyclopentanecarbonyl]-amino}-propionic acid | CHEMBL105054
TypeSmall organic molecule
Emp. Form.C23H29N3O5S
Mol. Mass.459.558
SMILESCC(C)[C@H](S)C(=O)NC1(CCCC1)C(=O)NC(Cc1ccc(nc1)-c1ccco1)C(O)=O