Reaction Details
TargetD(4) dopamine receptor
LigandBDBM50119902
Substrate/Competitorn/a
Meas. Tech.ChEBML_62966
Ki 14±n/a nM
Citation Zhao, HThurkauf, AHe, XHodgetts, KZhang, XRachwal, SKover, RXHutchison, APeterson, JKieltyka, ABrodbeck, RPrimus, RWasley, JW Indoline and piperazine containing derivatives as a novel class of mixed D(2)/D(4) receptor antagonists. Part 1: identification and structure-activity relationships. Bioorg Med Chem Lett12:3105-9 (2002) D(4) dopamine receptor
Name:D(4) dopamine receptor
Type:Enzyme
Mol. Mass.:48373.19
Organism:Homo sapiens (Human)
Description:P21917
Residue:419
BDBM50119902
NameBDBM50119902
Synonyms:2-[(R)-4-(4-Chloro-benzyl)-2-methyl-piperazin-1-yl]-1-(2,3-dihydro-indol-1-yl)-ethanone | CHEMBL104399
TypeSmall organic molecule
Emp. Form.C22H26ClN3O
Mol. Mass.383.914
SMILESC[C@@H]1CN(Cc2ccc(Cl)cc2)CCN1CC(=O)N1CCc2ccccc12