Reaction Details
TargetD(4) dopamine receptor
LigandBDBM50119922
Substrate/Competitorn/a
Meas. Tech.ChEMBL_58962 (CHEMBL669519)
Ki 7±n/a nM
Citation Zhao, HThurkauf, AHe, XHodgetts, KZhang, XRachwal, SKover, RXHutchison, APeterson, JKieltyka, ABrodbeck, RPrimus, RWasley, JW Indoline and piperazine containing derivatives as a novel class of mixed D(2)/D(4) receptor antagonists. Part 1: identification and structure-activity relationships. Bioorg Med Chem Lett12:3105-9 (2002) D(4) dopamine receptor
Name:D(4) dopamine receptor
Type:Enzyme
Mol. Mass.:48373.19
Organism:Homo sapiens (Human)
Description:P21917
Residue:419
BDBM50119922
NameBDBM50119922
Synonyms:2-[4-(4-Chloro-benzyl)-piperazin-1-yl]-1-((2R,3R)-2,3-dimethyl-2,3-dihydro-indol-1-yl)-ethanone | CHEMBL326670
TypeSmall organic molecule
Emp. Form.C23H28ClN3O
Mol. Mass.397.941
SMILESC[C@@H]1[C@H](C)c2ccccc2N1C(=O)CN1CCN(Cc2ccc(Cl)cc2)CC1