Reaction Details
TargetD(4) dopamine receptor
LigandBDBM50119967
Substrate/Competitorn/a
Meas. Tech.ChEBML_62964
Ki 12±n/a nM
Citation Zhao, HHe, XThurkauf, AHoffman, DKieltyka, ABrodbeck, RPrimus, RWasley, JW Indoline and piperazine containing derivatives as a novel class of mixed D(2)/D(4) receptor antagonists. Part 2: asymmetric synthesis and biological evaluation. Bioorg Med Chem Lett12:3111-5 (2002) D(4) dopamine receptor
Name:D(4) dopamine receptor
Type:Enzyme
Mol. Mass.:48373.19
Organism:Homo sapiens (Human)
Description:P21917
Residue:419
BDBM50119967
NameBDBM50119967
Synonyms:2-[4-(2,5-Dichloro-benzyl)-piperazin-1-yl]-1-((R)-2-methyl-2,3-dihydro-indol-1-yl)-ethanone | CHEMBL105172
TypeSmall organic molecule
Emp. Form.C22H25Cl2N3O
Mol. Mass.418.359
SMILESC[C@@H]1Cc2ccccc2N1C(=O)CN1CCN(Cc2cc(Cl)ccc2Cl)CC1