Reaction Details
TargetD(2) dopamine receptor
LigandBDBM50119965
Substrate/Competitorn/a
Meas. Tech.ChEBML_62961
Ki 271±n/a nM
Citation Zhao, HHe, XThurkauf, AHoffman, DKieltyka, ABrodbeck, RPrimus, RWasley, JW Indoline and piperazine containing derivatives as a novel class of mixed D(2)/D(4) receptor antagonists. Part 2: asymmetric synthesis and biological evaluation. Bioorg Med Chem Lett12:3111-5 (2002) D(2) dopamine receptor
Name:D(2) dopamine receptor
Type:Cell-surface receptors
Mol. Mass.:50647.10
Organism:Homo sapiens (Human)
Description:P14416
Residue:443
BDBM50119965
NameBDBM50119965
Synonyms:2-[4-(3,5-Dichloro-benzyl)-piperazin-1-yl]-1-((R)-2-methyl-2,3-dihydro-indol-1-yl)-ethanone | CHEMBL326010
TypeSmall organic molecule
Emp. Form.C22H25Cl2N3O
Mol. Mass.418.359
SMILESC[C@@H]1Cc2ccccc2N1C(=O)CN1CCN(Cc2cc(Cl)cc(Cl)c2)CC1