Reaction Details
TargetD(4) dopamine receptor
LigandBDBM50119976
Substrate/Competitorn/a
Meas. Tech.ChEBML_62964
Ki 5±n/a nM
Citation Zhao, HHe, XThurkauf, AHoffman, DKieltyka, ABrodbeck, RPrimus, RWasley, JW Indoline and piperazine containing derivatives as a novel class of mixed D(2)/D(4) receptor antagonists. Part 2: asymmetric synthesis and biological evaluation. Bioorg Med Chem Lett12:3111-5 (2002) D(4) dopamine receptor
Name:D(4) dopamine receptor
Type:Enzyme
Mol. Mass.:48373.19
Organism:Homo sapiens (Human)
Description:P21917
Residue:419
BDBM50119976
NameBDBM50119976
Synonyms:(S)-1-{2-[4-(4-Chloro-benzyl)-piperazin-1-yl]-acetyl}-2,3-dihydro-1H-indole-2-carboxylic acid methyl ester | CHEMBL107631
TypeSmall organic molecule
Emp. Form.C23H26ClN3O3
Mol. Mass.427.924
SMILESCOC(=O)[C@@H]1Cc2ccccc2N1C(=O)CN1CCN(Cc2ccc(Cl)cc2)CC1