Reaction Details
TargetGenome polyprotein/Non-structural protein 4A
LigandBDBM50120018
Substrate/Competitorn/a
Meas. Tech.ChEMBL_79052 (CHEMBL688663)
Ki 17000±n/a nM
Citation Sperandio, DGangloff, ARLitvak, JGoldsmith, RHataye, JMWang, VRShelton, EJElrod, KJanc, JWClark, JMRice, KWeinheimer, SYeung, KSMeanwell, NAHernandez, DStaab, AJVenables, BLSpencer, JR Highly potent non-peptidic inhibitors of the HCV NS3/NS4A serine protease. Bioorg Med Chem Lett12:3129-33 (2002) Genome polyprotein/Non-structural protein 4A
Name:Genome polyprotein/Non-structural protein 4A
Synonyms:Hepatitis C virus serine protease, NS3/NS4A
Type:n/a
Mol. Mass.:n/a
Description:ASSAY_ID of ChEMBL is 1969955
Components:This complex has 2 components.
Component 1
Name:Non-structural protein 4A
Type:PROTEIN
Mol. Mass.:5762.65
Organism:Hepatitis C virus
Description:ChEMBL_305334
Residue:54
Component 2
Name:Genome polyprotein
Synonyms:Hepatitis C virus NS3 protease/helicase | Hepatitis C virus serine protease, NS3/NS4A
Type:Protein
Mol. Mass.:67067.41
Organism:Hepatitis C virus
Description:A3EZI9
Residue:631
BDBM50120018
NameBDBM50120018
Synonyms:2-{[3-Methyl-2-(4,5,6,7-tetrafluoro-1H-benzoimidazol-2-ylmethyl)-3H-benzoimidazole-5-carbonyl]-amino}-3-phosphono-propionic acid | CHEMBL104390
TypeSmall organic molecule
Emp. Form.C20H16F4N5O6P
Mol. Mass.529.3383
SMILESCn1c(Cc2nc3c(F)c(F)c(F)c(F)c3[nH]2)nc2ccc(cc12)C(=O)NC(CP(O)(O)=O)C(O)=O