Reaction Details
TargetGenome polyprotein/Non-structural protein 4A
LigandBDBM50120023
Substrate/Competitorn/a
Meas. Tech.ChEMBL_79052 (CHEMBL688663)
Ki 15000±n/a nM
Citation Sperandio, DGangloff, ARLitvak, JGoldsmith, RHataye, JMWang, VRShelton, EJElrod, KJanc, JWClark, JMRice, KWeinheimer, SYeung, KSMeanwell, NAHernandez, DStaab, AJVenables, BLSpencer, JR Highly potent non-peptidic inhibitors of the HCV NS3/NS4A serine protease. Bioorg Med Chem Lett12:3129-33 (2002) Genome polyprotein/Non-structural protein 4A
Name:Genome polyprotein/Non-structural protein 4A
Synonyms:Hepatitis C virus serine protease, NS3/NS4A
Type:n/a
Mol. Mass.:n/a
Description:ASSAY_ID of ChEMBL is 1969955
Components:This complex has 2 components.
Component 1
Name:Non-structural protein 4A
Type:PROTEIN
Mol. Mass.:5762.65
Organism:Hepatitis C virus
Description:ChEMBL_305334
Residue:54
Component 2
Name:Genome polyprotein
Synonyms:Hepatitis C virus NS3 protease/helicase | Hepatitis C virus serine protease, NS3/NS4A
Type:Protein
Mol. Mass.:67067.41
Organism:Hepatitis C virus
Description:A3EZI9
Residue:631
BDBM50120023
NameBDBM50120023
Synonyms:2-[(2-{[6-(1-Carboxy-2-phosphono-ethylcarbamoyl)-1-methyl-1H-benzoimidazol-2-yl]-difluoro-methyl}-3H-benzoimidazole-5-carbonyl)-amino]-3-phosphono-propionic acid | CHEMBL104664
TypeSmall organic molecule
Emp. Form.C24H24F2N6O12P2
Mol. Mass.688.4247
SMILESCn1c(nc2ccc(cc12)C(=O)NC(CP(O)(O)=O)C(O)=O)C(F)(F)c1nc2ccc(cc2[nH]1)C(=O)NC(CP(O)(O)=O)C(O)=O