Reaction Details
TargetGenome polyprotein/Non-structural protein 4A
LigandBDBM50120048
Substrate/Competitorn/a
Meas. Tech.ChEMBL_79053 (CHEMBL877208)
Ki 200±n/a nM
Citation Sperandio, DGangloff, ARLitvak, JGoldsmith, RHataye, JMWang, VRShelton, EJElrod, KJanc, JWClark, JMRice, KWeinheimer, SYeung, KSMeanwell, NAHernandez, DStaab, AJVenables, BLSpencer, JR Highly potent non-peptidic inhibitors of the HCV NS3/NS4A serine protease. Bioorg Med Chem Lett12:3129-33 (2002) Genome polyprotein/Non-structural protein 4A
Name:Genome polyprotein/Non-structural protein 4A
Synonyms:Hepatitis C virus serine protease, NS3/NS4A
Type:n/a
Mol. Mass.:n/a
Description:ASSAY_ID of ChEMBL is 1969955
Components:This complex has 2 components.
Component 1
Name:Non-structural protein 4A
Type:PROTEIN
Mol. Mass.:5762.65
Organism:Hepatitis C virus
Description:ChEMBL_305334
Residue:54
Component 2
Name:Genome polyprotein
Synonyms:Hepatitis C virus NS3 protease/helicase | Hepatitis C virus serine protease, NS3/NS4A
Type:Protein
Mol. Mass.:67067.41
Organism:Hepatitis C virus
Description:A3EZI9
Residue:631
BDBM50120048
NameBDBM50120048
Synonyms:2-{[2-(5-Methoxy-1H-benzoimidazol-2-ylmethyl)-3-methyl-3H-benzoimidazole-5-carbonyl]-amino}-3-phosphono-propionic acid | CHEMBL325776
TypeSmall organic molecule
Emp. Form.C21H22N5O7P
Mol. Mass.487.4024
SMILESCOc1ccc2nc(Cc3nc4ccc(cc4n3C)C(=O)NC(CP(O)(O)=O)C(O)=O)[nH]c2c1