Reaction Details
TargetMu-type opioid receptor
LigandBDBM50120055
Substrate/Competitorn/a
Meas. Tech.ChEBML_149317
Ki 1050±n/a nM
Citation Roy, CLi, TKrasik, PGilbert, MJPelletier, CGagnon, DRobert, EDucharme, JStorer, RLavallée, JF Synthesis and structure--activity relationship of novel aminotetralin derivatives with high micro selective opioid affinity. Bioorg Med Chem Lett12:3141-3 (2002) Mu-type opioid receptor
Name:Mu-type opioid receptor
Type:G Protein-Coupled Receptor (GPCR)
Mol. Mass.:44789.51
Organism:Homo sapiens (Human)
Description:P35372
Residue:400
BDBM50120055
NameBDBM50120055
Synonyms:7-Amino-6-methanesulfinyl-8,8-dimethyl-5,6,7,8-tetrahydro-naphthalen-2-ol | CHEMBL107533
TypeSmall organic molecule
Emp. Form.C13H19NO2S
Mol. Mass.253.36
SMILESCS(=O)[C@@H]1Cc2ccc(O)cc2C(C)(C)[C@@H]1N