Reaction Details
TargetRetinoic acid receptor alpha
LigandBDBM50120066
Substrate/Competitorn/a
Meas. Tech.ChEMBL_32961 (CHEMBL644525)
EC50 8±n/a nM
Citation Beard, RLDuong, TTTeng, MKlein, ESStandevan, AMChandraratna, RA Synthesis and biological activity of retinoic acid receptor-alpha specific amides. Bioorg Med Chem Lett12:3145-8 (2002) Retinoic acid receptor alpha
Name:Retinoic acid receptor alpha
Type:PROTEIN
Mol. Mass.:50778.87
Organism:Homo sapiens (Human)
Description:ChEMBL_1466191
Residue:462
BDBM50120066
NameBDBM50120066
Synonyms:2-Fluoro-4-[(5,5,8,8-tetramethyl-5,6,7,8-tetrahydro-naphthalene-2-carbonyl)-amino]-benzoic acid | CHEMBL326911
TypeSmall organic molecule
Emp. Form.C22H24FNO3
Mol. Mass.369.4293
SMILESCC1(C)CCC(C)(C)c2cc(ccc12)C(=O)Nc1ccc(C(O)=O)c(F)c1