Reaction Details
TargetTyrosine-protein kinase Lck
LigandBDBM50120087
Substrate/Competitorn/a
Meas. Tech.ChEBML_96910
IC50 2±n/a nM
Citation Chen, PIwanowicz, EJNorris, DGu, HHLin, JMoquin, RVDas, JWityak, JSpergel, SHde Fex, HPang, SPitt, SShen, DRSchieven, GLBarrish, JC Synthesis and SAR of novel imidazoquinoxaline-based Lck inhibitors: improvement of cell potency. Bioorg Med Chem Lett12:3153-6 (2002) Tyrosine-protein kinase Lck
Name:Tyrosine-protein kinase Lck
Type:n/a
Mol. Mass.:57987.83
Organism:Homo sapiens (Human)
Description:P06239
Residue:509
BDBM50120087
NameBDBM50120087
Synonyms:(2-Chloro-6-methyl-phenyl)-[8-(4-ethyl-piperazin-1-yl)-imidazo[1,5-a]quinoxalin-4-yl]-amine N-(2-chloro-6-methylphenyl)-8-(4-ethylpiperazin-1-yl)imidazo[1,5-a]quinoxalin-4-amine
TypeSmall organic molecule
Emp. Form.C23H25ClN6
Mol. Mass.420.938
SMILESCCN1CCN(CC1)c1ccc2nc(Nc3c(C)cccc3Cl)c3cncn3c2c1