Reaction Details
TargetTyrosine-protein kinase Lck
LigandBDBM50120115
Substrate/Competitorn/a
Meas. Tech.ChEBML_96910
IC50 5±n/a nM
Citation Chen, PIwanowicz, EJNorris, DGu, HHLin, JMoquin, RVDas, JWityak, JSpergel, SHde Fex, HPang, SPitt, SShen, DRSchieven, GLBarrish, JC Synthesis and SAR of novel imidazoquinoxaline-based Lck inhibitors: improvement of cell potency. Bioorg Med Chem Lett12:3153-6 (2002) Tyrosine-protein kinase Lck
Name:Tyrosine-protein kinase Lck
Type:n/a
Mol. Mass.:57987.83
Organism:Homo sapiens (Human)
Description:P06239
Residue:509
BDBM50120115
NameBDBM50120115
Synonyms:CHEMBL321862 N4-(2-chloro-6-fluorophenyl)-N7-(2-(dimethylamino)ethyl)-8-methoxyimidazo[1,5-a]quinoxaline-4,7-diamine
TypeSmall organic molecule
Emp. Form.C21H22ClFN6O
Mol. Mass.428.89
SMILESCOc1cc2c(cc1NCCN(C)C)nc(Nc1c(F)cccc1Cl)c1cncn21