Reaction Details
TargetTyrosine-protein kinase Lck
LigandBDBM50120130
Substrate/Competitorn/a
Meas. Tech.ChEBML_96910
IC50 3±n/a nM
Citation Chen, PIwanowicz, EJNorris, DGu, HHLin, JMoquin, RVDas, JWityak, JSpergel, SHde Fex, HPang, SPitt, SShen, DRSchieven, GLBarrish, JC Synthesis and SAR of novel imidazoquinoxaline-based Lck inhibitors: improvement of cell potency. Bioorg Med Chem Lett12:3153-6 (2002) Tyrosine-protein kinase Lck
Name:Tyrosine-protein kinase Lck
Type:n/a
Mol. Mass.:57987.83
Organism:Homo sapiens (Human)
Description:P06239
Residue:509
BDBM50120130
NameBDBM50120130
Synonyms:CHEMBL110732 N-[4-(2-Chloro-6-methyl-phenylamino)-imidazo[1,5-a]quinoxalin-8-yl]-acetamide
TypeSmall organic molecule
Emp. Form.C19H16ClN5O
Mol. Mass.365.816
SMILESCC(=O)Nc1ccc2nc(Nc3c(C)cccc3Cl)c3cncn3c2c1