Reaction Details
TargetSerine protease 1
LigandBDBM50228863
Substrate/Competitorn/a
Meas. Tech.ChEBML_212345
IC50 0.045000±n/a nM
Citation Iwanowicz, EJKimball, SDLin, JLau, WHan, WCWang, TCRoberts, DGSchumacher, WAOgletree, MLSeiler, SM Retro-binding thrombin active site inhibitors: identification of an orally active inhibitor of thrombin catalytic activity. Bioorg Med Chem Lett12:3183-6 (2002) Serine protease 1
Name:Serine protease 1
Type:Enzyme
Mol. Mass.:25790.52
Organism:Bos taurus (bovine)
Description:P00760
Residue:246
BDBM50228863
NameBDBM50228863
Synonyms:(S)-1-((R)-2-Methylamino-3-phenyl-propionyl)-pyrrolidine-2-carboxylic acid ((S)-1-formyl-4-guanidino-butyl)-amide 5N-[4-amino(imino)methylamino-1-formyl-(1S)-butyl]-1-[2-methylamino-3-phenyl-(2R)-propanoyl]-(5S)-dihydro-1H-5-pyrrolecarboxamide Me-(D-Phe)-Pro-Arg-CHO
TypeSmall organic molecule
Emp. Form.C21H32N6O3
Mol. Mass.416.5172
SMILES[#6]-[#7]-[#6@H](-[#6]-c1ccccc1)-[#6](=O)-[#7]-1-[#6]-[#6]-[#6]-[#6@H]-1-[#6](=O)-[#7]-[#6@@H](-[#6]-[#6]-[#6]\[#7]=[#6](\[#7])-[#7])-[#6]=O