Reaction Details
TargetProthrombin
LigandBDBM50120228
Substrate/Competitorn/a
Meas. Tech.ChEBML_34097
IC50 16±n/a nM
Citation Iwanowicz, EJKimball, SDLin, JLau, WHan, WCWang, TCRoberts, DGSchumacher, WAOgletree, MLSeiler, SM Retro-binding thrombin active site inhibitors: identification of an orally active inhibitor of thrombin catalytic activity. Bioorg Med Chem Lett12:3183-6 (2002) Prothrombin
Name:Prothrombin
Type:Protein
Mol. Mass.:70029.57
Organism:Homo sapiens (Human)
Description:P00734
Residue:622
BDBM50120228
NameBDBM50120228
Synonyms:CHEMBL111195 | Cyclohexyl-{2-[2-(4-guanidino-butyrylamino)-3-(4-nitro-phenyl)-propionylamino]-3-hydroxy-butyrylamino}-acetic acid methyl ester
TypeSmall organic molecule
Emp. Form.C27H41N7O8
Mol. Mass.591.6565
SMILESCOC(=O)C(NC(=O)C(NC(=O)C(Cc1ccc(cc1)[N+]([O-])=O)NC(=O)CCC[N-]C(N)=[NH2+])C(C)O)C1CCCCC1