Reaction Details
TargetCoagulation factor X
LigandBDBM50120225
Substrate/Competitorn/a
Meas. Tech.ChEBML_48622
IC50 4.6±n/a nM
Citation Iwanowicz, EJKimball, SDLin, JLau, WHan, WCWang, TCRoberts, DGSchumacher, WAOgletree, MLSeiler, SM Retro-binding thrombin active site inhibitors: identification of an orally active inhibitor of thrombin catalytic activity. Bioorg Med Chem Lett12:3183-6 (2002) Coagulation factor X
Name:Coagulation factor X
Type:Enzyme
Mol. Mass.:54726.60
Organism:Homo sapiens (Human)
Description:n/a
Residue:488
BDBM50120225
NameBDBM50120225
Synonyms:2-{[2-(4-Guanidino-butyrylamino)-3-(4-nitro-phenyl)-propionyl]-methyl-amino}-3-hydroxy-N-(1-phenyl-ethyl)-butyramide | CHEMBL105819
TypeSmall organic molecule
Emp. Form.C27H37N7O6
Mol. Mass.555.626
SMILESCC(O)C(N(C)C(=O)C(Cc1ccc(cc1)[N+]([O-])=O)NC(=O)CCC[N-]C(N)=[NH2+])C(=O)NC(C)c1ccccc1