Reaction Details
TargetTranslocator protein
LigandBDBM50120340
Substrate/Competitorn/a
Meas. Tech.ChEBML_37065
Ki 7±n/a nM
Citation Pacofsky, GJStafford, JACox, RFCowan, JRDorsey, GFGonzales, SSKaldor, IKoszalka, GWLovell, GGMcIntyre, MSTidwell, JHTodd, DWhitesell, GWiard, RPFeldman, PL Relating the structure, activity, and physical properties of ultrashort-acting benzodiazepine receptor agonists. Bioorg Med Chem Lett12:3219-22 (2002) Translocator protein
Name:Translocator protein
Type:Mitochondrion membrane protein
Mol. Mass.:18945.84
Organism:Rattus norvegicus (rat)
Description:Competitive binding experiments were performed on rat kidney mitochondrial membranes.
Residue:169
BDBM50120340
NameBDBM50120340
Synonyms:3-[(S)-7-Chloro-5-(2-fluoro-phenyl)-2-oxo-2,3-dihydro-1H-benzo[e][1,4]diazepin-3-yl]-propionic acid methyl ester | CHEMBL108991
TypeSmall organic molecule
Emp. Form.C19H16ClFN2O3
Mol. Mass.374.793
SMILESCOC(=O)CC[C@@H]1N=C(c2ccccc2F)c2cc(Cl)ccc2NC1=O