Reaction Details
Target5-hydroxytryptamine receptor 4
LigandBDBM50105650
Substrate/Competitorn/a
Meas. Tech.ChEMBL_3343 (CHEMBL619043)
Ki 0.29±n/a nM
Citation López-Rodríguez, MLMurcia, MBenhamú, BViso, ACampillo, MPardo, L Benzimidazole derivatives. 3. 3D-QSAR/CoMFA model and computational simulation for the recognition of 5-HT(4) receptor antagonists. J Med Chem45:4806-15 (2002) 5-hydroxytryptamine receptor 4
Name:5-hydroxytryptamine receptor 4
Type:Enzyme Catalytic Domain
Mol. Mass.:46117.31
Organism:RAT
Description:5-HT4 HTR4 RAT::Q62758
Residue:406
BDBM50105650
NameBDBM50105650
Synonyms:6-Chloro-1H-benzoimidazole-4-carboxylic acid (1-isobutyl-piperidin-4-ylmethyl)-amide | CHEMBL262950
TypeSmall organic molecule
Emp. Form.C18H25ClN4O
Mol. Mass.348.87
SMILESCC(C)CN1CCC(CNC(=O)c2cc(Cl)cc3nc[nH]c23)CC1