Reaction Details
TargetGrowth hormone secretagogue receptor type 1
LigandBDBM50120503
Substrate/Competitorn/a
Meas. Tech.ChEBML_89487
Ki 18±n/a nM
Citation Carpino, PALefker, BAToler, SMPan, LCHadcock, JRMurray, MCCook, ERDiBrino, JNDeNinno, SLChidsey-Frink, KLHada, WAInthavongsay, JLewis, SKMangano, FMMullins, MANickerson, DFNg, OPirie, CMRagan, JARose, CRTess, DAWright, ASYu, LZawistoski, MPPettersen, JCDaSilva-Jardine, PAWilson, TCThompson, DD Discovery and biological characterization of capromorelin analogues with extended half-lives. Bioorg Med Chem Lett12:3279-82 (2002) Growth hormone secretagogue receptor type 1
Name:Growth hormone secretagogue receptor type 1
Type:Receptor
Mol. Mass.:41334.57
Organism:Homo sapiens (Human)
Description:Receptor binding studies use plasma membranes from LLC PK-1 cells transiently transfected with hGHSR1a.
Residue:366
BDBM50120503
NameBDBM50120503
Synonyms:2-Amino-N-[(R)-2-(3a-benzyl-2-methyl-3-oxo-2,3,3a,4,6,7-hexahydro-pyrazolo[4,3-c]pyridin-5-yl)-1-(3,4-difluoro-benzyloxymethyl)-2-oxo-ethyl]-2-methyl-propionamide | CHEMBL111026
TypeSmall organic molecule
Emp. Form.C28H33F2N5O4
Mol. Mass.541.5895
SMILESCN1N=C2CCN(CC2(Cc2ccccc2)C1=O)C(=O)[C@@H](COCc1ccc(F)c(F)c1)NC(=O)C(C)(C)N