Reaction Details
TargetIntegrin alpha-V/beta-3
LigandBDBM50120517
Substrate/Competitorn/a
Meas. Tech.ChEMBL_214634 (CHEMBL819714)
IC50 0.300000±n/a nM
Citation Perron-Sierra, FSaint Dizier, DBertrand, MGenton, ATucker, GCCasara, P Substituted benzocyloheptenes as potent and selective alpha(v) integrin antagonists. Bioorg Med Chem Lett12:3291-6 (2002) Integrin alpha-V/beta-3
Name:Integrin alpha-V/beta-3
Type:Enzyme
Mol. Mass.:n/a
Description:n/a
Components:This complex has 2 components.
Component 1
Name:Integrin alpha-V
Synonyms:ITAV_HUMAN Integrin alpha-V/alpha-5 VNRA Vitronectin receptor | Vitronectin receptor subunit alpha
Type:PROTEIN
Mol. Mass.:116024.92
Organism:Homo sapiens (Human)
Description:ChEMBL_582336
Residue:1048
Component 2
Name:Integrin beta-3
Synonyms:CD_antigen=CD61 GPIIIa ITGB3 Platelet membrane glycoprotein IIIa
Type:Protein
Mol. Mass.:87038.91
Organism:Homo sapiens (Human)
Description:P05106
Residue:788
BDBM50120517
NameBDBM50120517
Synonyms:CHEMBL109703 | {7-[(4-5,6,7,8-Tetrahydro-[1,8]naphthyridin-2-yl-butyrylamino)-methyl]-6,9-dihydro-5H-benzocyclohepten-5-yl}-acetic acid
TypeSmall organic molecule
Emp. Form.C26H31N3O3
Mol. Mass.433.5426
SMILESOC(=O)CC1CC(CNC(=O)CCCc2ccc3CCCNc3n2)=CCc2ccccc12