Reaction Details
TargetGonadotropin-releasing hormone receptor
LigandBDBM50120658
Substrate/Competitorn/a
Meas. Tech.ChEMBL_71457 (CHEMBL685986)
IC50 0.300000±n/a nM
Citation Simeone, JPBugianesi, RLPonpipom, MMYang, YTLo, JLYudkovitz, JBCui, JMount, GRRen, RNCreighton, MMao, AHVincent, SHCheng, KGoulet, MT Modification of the pyridine moiety of non-peptidyl indole GnRH receptor antagonists. Bioorg Med Chem Lett12:3329-32 (2002) Gonadotropin-releasing hormone receptor
Name:Gonadotropin-releasing hormone receptor
Type:Enzyme
Mol. Mass.:37749.45
Organism:Homo sapiens (Human)
Description:P30968
Residue:328
BDBM50120658
NameBDBM50120658
Synonyms:1-(2-Aza-bicyclo[2.2.2]oct-2-yl)-2-(2-(3,5-dimethyl-phenyl)-3-{(S)-1-methyl-2-[2-(2-methyl-1-oxy-pyridin-4-yl)-ethylamino]-ethyl}-1H-indol-5-yl)-2-methyl-propan-1-one | CHEMBL324654
TypeSmall organic molecule
Emp. Form.C38H48N4O2
Mol. Mass.592.8133
SMILESC[C@H](CNCCc1cc[n+]([O-])c(C)c1)c1c([nH]c2ccc(cc12)C(C)(C)C(=O)N1CC2CCC1CC2)-c1cc(C)cc(C)c1