Reaction Details
TargetMatrix metalloproteinase-9
LigandBDBM50247572
Substrate/Competitorn/a
Meas. Tech.ChEMBL_105374 (CHEMBL712453)
Ki 35±n/a nM
Citation Duan, JJChen, LWasserman, ZRLu, ZLiu, RQCovington, MBQian, MHardman, KDMagolda, RLNewton, RCChrist, DDWexler, RRDecicco, CP Discovery of gamma-lactam hydroxamic acids as selective inhibitors of tumor necrosis factor alpha converting enzyme: design, synthesis, and structure-activity relationships. J Med Chem45:4954-7 (2002) Matrix metalloproteinase-9
Name:Matrix metalloproteinase-9
Type:Enzyme
Mol. Mass.:78452.28
Organism:Homo sapiens (Human)
Description:P14780
Residue:707
BDBM50247572
NameBDBM50247572
Synonyms:(R)-2-((S)-3-(biphenyl-4-yl)-3-methyl-2-oxopyrrolidin-1-yl)-N-hydroxypropanamide | CHEMBL515390
TypeSmall organic molecule
Emp. Form.C20H22N2O3
Mol. Mass.338.4003
SMILESC[C@@H](N1CC[C@](C)(C1=O)c1ccc(cc1)-c1ccccc1)C(=O)NO