Reaction Details
TargetMatrix metalloproteinase-9
LigandBDBM50120688
Substrate/Competitorn/a
Meas. Tech.ChEMBL_105374 (CHEMBL712453)
Ki 9±n/a nM
Citation Duan, JJChen, LWasserman, ZRLu, ZLiu, RQCovington, MBQian, MHardman, KDMagolda, RLNewton, RCChrist, DDWexler, RRDecicco, CP Discovery of gamma-lactam hydroxamic acids as selective inhibitors of tumor necrosis factor alpha converting enzyme: design, synthesis, and structure-activity relationships. J Med Chem45:4954-7 (2002) Matrix metalloproteinase-9
Name:Matrix metalloproteinase-9
Type:Enzyme
Mol. Mass.:78452.28
Organism:Homo sapiens (Human)
Description:P14780
Residue:707
BDBM50120688
NameBDBM50120688
Synonyms:CHEMBL146896 | N-Hydroxy-2-[3-(4-methoxy-phenyl)-3-methyl-2-oxo-pyrrolidin-1-yl]-propionamide
TypeSmall organic molecule
Emp. Form.C15H20N2O4
Mol. Mass.292.3303
SMILESCOc1ccc(cc1)[C@]1(C)CCN([C@H](C)C(=O)NO)C1=O