Reaction Details
Target72 kDa type IV collagenase
LigandBDBM50120687
Substrate/Competitorn/a
Meas. Tech.ChEMBL_104397 (CHEMBL715000)
Ki 35±n/a nM
Citation Duan, JJChen, LWasserman, ZRLu, ZLiu, RQCovington, MBQian, MHardman, KDMagolda, RLNewton, RCChrist, DDWexler, RRDecicco, CP Discovery of gamma-lactam hydroxamic acids as selective inhibitors of tumor necrosis factor alpha converting enzyme: design, synthesis, and structure-activity relationships. J Med Chem45:4954-7 (2002) 72 kDa type IV collagenase
Name:72 kDa type IV collagenase
Type:Enzyme
Mol. Mass.:73870.36
Organism:Homo sapiens (Human)
Description: P08253
Residue:660
BDBM50120687
NameBDBM50120687
Synonyms:CHEMBL144081 | N-Hydroxy-2-{3-methyl-3-[4-(2-nitro-benzyloxy)-phenyl]-2-oxo-pyrrolidin-1-yl}-propionamide
TypeSmall organic molecule
Emp. Form.C21H23N3O6
Mol. Mass.413.4238
SMILESC[C@@H](N1CC[C@](C)(C1=O)c1ccc(OCc2ccccc2[N+]([O-])=O)cc1)C(=O)NO