Reaction Details
TargetInterstitial collagenase
LigandBDBM50120691
Substrate/Competitorn/a
Meas. Tech.ChEMBL_106129 (CHEMBL718677)
Ki 143±n/a nM
Citation Duan, JJChen, LWasserman, ZRLu, ZLiu, RQCovington, MBQian, MHardman, KDMagolda, RLNewton, RCChrist, DDWexler, RRDecicco, CP Discovery of gamma-lactam hydroxamic acids as selective inhibitors of tumor necrosis factor alpha converting enzyme: design, synthesis, and structure-activity relationships. J Med Chem45:4954-7 (2002) Interstitial collagenase
Name:Interstitial collagenase
Type:Enzyme
Mol. Mass.:54010.26
Organism:Homo sapiens (Human)
Description: P03956
Residue:469
BDBM50120691
NameBDBM50120691
Synonyms:(R)-N-hydroxy-2-((S)-3-methyl-2-oxo-3-(4-phenoxyphenyl)pyrrolidin-1-yl)propanamide N-Hydroxy-2-[3-methyl-2-oxo-3-(4-phenoxy-phenyl)-pyrrolidin-1-yl]-propionamide
TypeSmall organic molecule
Emp. Form.C20H22N2O4
Mol. Mass.354.3997
SMILESC[C@@H](N1CC[C@](C)(C1=O)c1ccc(Oc2ccccc2)cc1)C(=O)NO