Reaction Details
Target72 kDa type IV collagenase
LigandBDBM50120695
Substrate/Competitorn/a
Meas. Tech.ChEMBL_104397 (CHEMBL715000)
Ki>3000±n/a nM
Citation Duan, JJChen, LWasserman, ZRLu, ZLiu, RQCovington, MBQian, MHardman, KDMagolda, RLNewton, RCChrist, DDWexler, RRDecicco, CP Discovery of gamma-lactam hydroxamic acids as selective inhibitors of tumor necrosis factor alpha converting enzyme: design, synthesis, and structure-activity relationships. J Med Chem45:4954-7 (2002) 72 kDa type IV collagenase
Name:72 kDa type IV collagenase
Type:Enzyme
Mol. Mass.:73870.36
Organism:Homo sapiens (Human)
Description: P08253
Residue:660
BDBM50120695
NameBDBM50120695
Synonyms:2-{3-[4-(3,5-Dimethoxy-benzyloxy)-phenyl]-3-methyl-2-oxo-pyrrolidin-1-yl}-N-hydroxy-propionamide | CHEMBL143451
TypeSmall organic molecule
Emp. Form.C23H28N2O6
Mol. Mass.428.4782
SMILESCOc1cc(COc2ccc(cc2)[C@]2(C)CCN([C@H](C)C(=O)NO)C2=O)cc(OC)c1