Reaction Details
Target72 kDa type IV collagenase
LigandBDBM50120689
Substrate/Competitorn/a
Meas. Tech.ChEMBL_104397 (CHEMBL715000)
Ki>3000±n/a nM
Citation Duan, JJChen, LWasserman, ZRLu, ZLiu, RQCovington, MBQian, MHardman, KDMagolda, RLNewton, RCChrist, DDWexler, RRDecicco, CP Discovery of gamma-lactam hydroxamic acids as selective inhibitors of tumor necrosis factor alpha converting enzyme: design, synthesis, and structure-activity relationships. J Med Chem45:4954-7 (2002) 72 kDa type IV collagenase
Name:72 kDa type IV collagenase
Type:Enzyme
Mol. Mass.:73870.36
Organism:Homo sapiens (Human)
Description: P08253
Residue:660
BDBM50120689
NameBDBM50120689
Synonyms:(R)-2-((S)-3-(4-(3,5-bis(trifluoromethyl)benzyloxy)phenyl)-3-methyl-2-oxopyrrolidin-1-yl)-N-hydroxypropanamide CHEMBL144320
TypeSmall organic molecule
Emp. Form.C23H22F6N2O4
Mol. Mass.504.4222
SMILESC[C@@H](N1CC[C@](C)(C1=O)c1ccc(OCc2cc(cc(c2)C(F)(F)F)C(F)(F)F)cc1)C(=O)NO