Reaction Details
Target72 kDa type IV collagenase
LigandBDBM50120696
Substrate/Competitorn/a
Meas. Tech.ChEMBL_104397 (CHEMBL715000)
Ki 19±n/a nM
Citation Duan, JJChen, LWasserman, ZRLu, ZLiu, RQCovington, MBQian, MHardman, KDMagolda, RLNewton, RCChrist, DDWexler, RRDecicco, CP Discovery of gamma-lactam hydroxamic acids as selective inhibitors of tumor necrosis factor alpha converting enzyme: design, synthesis, and structure-activity relationships. J Med Chem45:4954-7 (2002) 72 kDa type IV collagenase
Name:72 kDa type IV collagenase
Type:Enzyme
Mol. Mass.:73870.36
Organism:Homo sapiens (Human)
Description: P08253
Residue:660
BDBM50120696
NameBDBM50120696
Synonyms:(R)-2-((S)-3-(4-(benzyloxy)phenyl)-3-methyl-2-oxopyrrolidin-1-yl)-N-hydroxypropanamide CHEMBL357675
TypeSmall organic molecule
Emp. Form.C21H24N2O4
Mol. Mass.368.4263
SMILESC[C@@H](N1CC[C@](C)(C1=O)c1ccc(OCc2ccccc2)cc1)C(=O)NO