Reaction Details
TargetPoly [ADP-ribose] polymerase 1
LigandBDBM50120707
Substrate/Competitorn/a
Meas. Tech.ChEMBL_159659 (CHEMBL761787)
Ki 5±n/a nM
Citation Canan Koch, SSThoresen, LHTikhe, JGMaegley, KAAlmassy, RJLi, JYu, XHZook, SEKumpf, RAZhang, CBoritzki, TJMansour, RNZhang, KEEkker, ACalabrese, CRCurtin, NJKyle, SThomas, HDWang, LZCalvert, AHGolding, BTGriffin, RJNewell, DRWebber, SEHostomsky, Z Novel tricyclic poly(ADP-ribose) polymerase-1 inhibitors with potent anticancer chemopotentiating activity: design, synthesis, and X-ray cocrystal structure. J Med Chem45:4961-74 (2002) Poly [ADP-ribose] polymerase 1
Name:Poly [ADP-ribose] polymerase 1
Type:n/a
Mol. Mass.:113114.22
Organism:Homo sapiens (Human)
Description:P09874
Residue:1014
BDBM50120707
NameBDBM50120707
Synonyms:2-Thiophen-2-yl-1,3,4,5-tetrahydro-azepino[5,4,3-cd]indol-6-one | CHEMBL144084
TypeSmall organic molecule
Emp. Form.C15H12N2OS
Mol. Mass.268.334
SMILESO=C1NCCc2c([nH]c3cccc1c23)-c1cccs1