Reaction Details
TargetPoly [ADP-ribose] polymerase 1
LigandBDBM50120710
Substrate/Competitorn/a
Meas. Tech.ChEMBL_159659 (CHEMBL761787)
Ki 7.0±n/a nM
Citation Canan Koch, SSThoresen, LHTikhe, JGMaegley, KAAlmassy, RJLi, JYu, XHZook, SEKumpf, RAZhang, CBoritzki, TJMansour, RNZhang, KEEkker, ACalabrese, CRCurtin, NJKyle, SThomas, HDWang, LZCalvert, AHGolding, BTGriffin, RJNewell, DRWebber, SEHostomsky, Z Novel tricyclic poly(ADP-ribose) polymerase-1 inhibitors with potent anticancer chemopotentiating activity: design, synthesis, and X-ray cocrystal structure. J Med Chem45:4961-74 (2002) Poly [ADP-ribose] polymerase 1
Name:Poly [ADP-ribose] polymerase 1
Type:n/a
Mol. Mass.:113114.22
Organism:Homo sapiens (Human)
Description:P09874
Residue:1014
BDBM50120710
NameBDBM50120710
Synonyms:2-(3-Amino-phenyl)-1,3,4,5-tetrahydro-azepino[5,4,3-cd]indol-6-one | CHEMBL343263
TypeSmall organic molecule
Emp. Form.C17H15N3O
Mol. Mass.277.3205
SMILESNc1cccc(c1)-c1[nH]c2cccc3C(=O)NCCc1c23