Reaction Details
TargetDelta-type opioid receptor
LigandBDBM50120877
Substrate/Competitorn/a
Meas. Tech.ChEMBL_145768 (CHEMBL752786)
IC50>1000±n/a nM
Citation Ogawa, TMiyamae, TMurayama, KOkuyama, KOkayama, THagiwara, MSakurada, SMorikawa, T Synthesis and structure-activity relationships of an orally available and long-acting analgesic peptide, N(alpha)-amidino-Tyr-D-Arg-Phe-MebetaAla-OH (ADAMB). J Med Chem45:5081-9 (2002) Delta-type opioid receptor
Name:Delta-type opioid receptor
Type:Enzyme Catalytic Domain
Mol. Mass.:40577.25
Organism:MOUSE
Description:P32300
Residue:372
BDBM50120877
NameBDBM50120877
Synonyms:2-[(2-{5-Guanidino-2-[3-(3-hydroxy-phenyl)-2-methylamino-propionylamino]-pentanoylamino}-3-phenyl-propionyl)-methyl-amino]-propionic acid | CHEMBL358350
TypeSmall organic molecule
Emp. Form.C29H41N7O6
Mol. Mass.583.6791
SMILESCN[C@@H](Cc1cccc(O)c1)C(=O)N[C@@H](CCCNC(N)=N)C(=O)N[C@@H](Cc1ccccc1)C(=O)N(C)[C@@H](C)C(O)=O