Reaction Details
TargetKappa-type opioid receptor
LigandBDBM50120875
Substrate/Competitorn/a
Meas. Tech.ChEMBL_145551 (CHEMBL751015)
IC50>1000±n/a nM
Citation Ogawa, TMiyamae, TMurayama, KOkuyama, KOkayama, THagiwara, MSakurada, SMorikawa, T Synthesis and structure-activity relationships of an orally available and long-acting analgesic peptide, N(alpha)-amidino-Tyr-D-Arg-Phe-MebetaAla-OH (ADAMB). J Med Chem45:5081-9 (2002) Kappa-type opioid receptor
Name:Kappa-type opioid receptor
Type:Enzyme
Mol. Mass.:42656.78
Organism:Mus musculus (Mouse)
Description:P33534
Residue:380
BDBM50120875
NameBDBM50120875
Synonyms:2-(2-{5-Guanidino-2-[2-guanidino-3-(3-hydroxy-phenyl)-propionylamino]-pentanoylamino}-3-phenyl-propionylamino)-propionic acid | CHEMBL148588
TypeSmall organic molecule
Emp. Form.C28H39N9O6
Mol. Mass.597.666
SMILES[#6]-[#6@H](-[#7]-[#6](=O)-[#6@H](-[#6]-c1ccccc1)-[#7]-[#6](=O)-[#6@H](-[#6]-[#6]-[#6]-[#7]-[#6](-[#7])=[#7])-[#7]-[#6](=O)-[#6@H](-[#6]-c1cccc(-[#8])c1)\[#7]=[#6](/[#7])-[#7])-[#6](-[#8])=O