Reaction Details
TargetCathepsin S
LigandBDBM50121031
Substrate/Competitorn/a
Meas. Tech.ChEBML_48689
IC50 260±n/a nM
Citation Zhou, NEGuo, DKaleta, JPurisima, EMenard, RMicetich, RGSingh, R Design and synthesis of 6-substituted amino-4-oxa-1-azabicyclo[3,2,0]heptan-7-one derivatives as cysteine proteases inhibitors. Bioorg Med Chem Lett12:3413-5 (2002) Cathepsin S
Name:Cathepsin S
Type:Protein
Mol. Mass.:37507.38
Organism:Homo sapiens (Human)
Description:P25774
Residue:331
BDBM50121031
NameBDBM50121031
Synonyms:CHEMBL419772 | [(S)-2-Methyl-1-((5R,6S)-7-oxo-4-oxa-1-aza-bicyclo[3.2.0]hept-6-ylcarbamoyl)-propyl]-carbamic acid benzyl ester
TypeSmall organic molecule
Emp. Form.C18H23N3O5
Mol. Mass.361.3923
SMILESCC(C)[C@H](NC(=O)OCc1ccccc1)C(=O)N[C@H]1[C@H]2OCCN2C1=O